Target
Beta-2 adrenergic receptor
Ligand
BDBM84269
Substrate
Meas. Tech.
Dose response for HTS for Beta-2AR agonists via FAP method from CP1
EC50
5110±n/a nM
Citation
 PubChem, PC Dose response for HTS for Beta-2AR agonists via FAP method from CP1 PubChem Bioassay (2011)[AID] 
Target
Name:
Beta-2 adrenergic receptor
Synonyms:
ADRB2 ADRB2_HUMAN Beta-2 adrenoceptor | Beta-2 adrenoreceptor
Type:
Mol. Mass.:
46461.69
Organism:
Homo sapiens (Human)
Description:
P07550
Residue:
413
  
Inhibitor
Name:
BDBM84269
Synonyms:
4-(2-methoxyphenoxy)-N-(1,3-thiazol-2-yl)butanamide 4-(2-methoxyphenoxy)-N-1,3-thiazol-2-ylbutanamide MLS000665914 cid_1631626
Type:
Small organic molecule
Emp. Form.:
C14H16N2O3S
Mol. Mass.:
292.353
SMILES:
COc1ccccc1OCCCC(=O)Nc1nccs1
: