Target
5-hydroxytryptamine receptor 6
Ligand
BDBM35256
Substrate
Ki
100±n/a nM
Comments
PDSP_1235
Citation
 Plassat, JLAmlaiky, NHen, R Molecular cloning of a mammalian serotonin receptor that activates adenylate cyclase. Mol Pharmacol 44:229-36 (1993) Target
Name:
5-hydroxytryptamine receptor 6
Synonyms:
5-HT6 5HT6R_MOUSE | Htr6
Type:
Enzyme Catalytic Domain
Mol. Mass.:
47012.98
Organism:
MOUSE
Description:
5-HT6 HTR6 MOUSE::Q9R1C8
Residue:
440
  
Inhibitor
Name:
BDBM35256
Synonyms:
(S)-mianserin MIANSERIN MIANSERIN (-) | Tolvon
Type:
Small organic molecule
Emp. Form.:
C18H20N2
Mol. Mass.:
264.3648
SMILES:
[H][C@]12CN(C)CCN1c1ccccc1Cc1ccccc21
: