Target
Gonadotropin-releasing hormone receptor
Ligand
BDBM50000001
Substrate
Meas. Tech.
ChEBML_71584
Kd
0.480000±n/a nM
Citation
 Rivier, JPorter, JHoeger, CTheobald, PCraig, AGDykert, JCorrigan, APerrin, MHook, WASiraganian, RP Gonadotropin-releasing hormone antagonists with N omega-triazolylornithine, -lysine, or -p-aminophenylalanine residues at positions 5 and 6. J Med Chem 35:4270-8 (1992)  
Target
Name:
Gonadotropin-releasing hormone receptor
Synonyms:
GNRHR GRHR GnRH-R Gonadotropin-releasing hormone receptor | Gonadotropin-releasing hormone receptor (GnRH)
Type:
Enzyme
Mol. Mass.:
37749.45
Organism:
Homo sapiens (Human)
Description:
P30968
Residue:
328
  
Inhibitor
Name:
BDBM50000001
Synonyms:
CHEMBL2370818 | [Ac-(D)Nal-(D)Cpa-(D)Pal-Ser-Lys(atz)-(D)Lys(atz)-Leu-ILys-Pro-Gly-NHEt]GnRH
Type:
Small organic molecule
Emp. Form.:
C74H106ClN23O12
Mol. Mass.:
1545.233
SMILES:
CC(C)C[C@H](NC(=O)[C@H](CCCCNc1n[nH]c(N)n1)NC(=O)[C@H](CCCCNc1n[nH]c(N)n1)NC(=O)[C@H](CO)NC(=O)[C@@H](Cc1cccnc1)NC(=O)[C@H](Cc1ccc(Cl)cc1)NC(=O)[C@@H](Cc1ccc2ccccc2c1)NC(C)=O)C(=O)N[C@@H](CCCCNC(C)C)C(=O)N1CCC[C@@H]1C(=O)N[C@@H](C)C(N)=O
: