Target
Baculoviral IAP repeat-containing protein 2
Ligand
BDBM50239422
Substrate
Meas. Tech.
ChEMBL_1666043 (CHEMBL4015839)
IC50
0.320000±n/a nM
Citation
 Tamanini, EBuck, IMChessari, GChiarparin, EDay, JEHFrederickson, MGriffiths-Jones, CMHearn, KHeightman, TDIqbal, AJohnson, CNLewis, EJMartins, VPeakman, TReader, MRich, SJWard, GAWilliams, PAWilsher, NE Discovery of a Potent Nonpeptidomimetic, Small-Molecule Antagonist of Cellular Inhibitor of Apoptosis Protein 1 (cIAP1) and X-Linked Inhibitor of Apoptosis Protein (XIAP). J Med Chem 60:4611-4625 (2017)  
Target
Name:
Baculoviral IAP repeat-containing protein 2
Synonyms:
API1 BIRC2_HUMAN Cellular inhibitor of apoptosis 1 MIHB | RNF48
Type:
Protein
Mol. Mass.:
69900.47
Organism:
Homo sapiens (Human)
Description:
Q13490
Residue:
618
  
Inhibitor
Name:
BDBM50239422
Synonyms:
CHEMBL234346
Type:
Small organic molecule
Emp. Form.:
C19H34N4O5
Mol. Mass.:
398.4971
SMILES:
CC[C@H](C)[C@H](NC(=O)[C@@H]1CCCN1C(=O)[C@@H](NC(=O)[C@H](C)N)C(C)C)C(O)=O
: