Target
Bile salt export pump
Ligand
BDBM30703
Substrate
Meas. Tech.
ChEMBL_1667662 (CHEMBL4017550)
IC50
>796100±n/a nM
Citation
 Warner, DJChen, HCantin, LDKenna, JGStahl, SWalker, CLNoeske, T Mitigating the inhibition of human bile salt export pump by drugs: opportunities provided by physicochemical property modulation, in silico modeling, and structural modification. Drug Metab Dispos 40:2332-41 (2012)  
Target
Name:
Bile salt export pump
Synonyms:
ABCB11 ATP-binding cassette sub-family B member 11 Bile Salt Export Pump, BSEP Bile salt export pump (BSEP)
Type:
Protein
Mol. Mass.:
146405.49
Organism:
Homo sapiens (Human)
Description:
O95342
Residue:
1321
  
Inhibitor
Name:
BDBM30703
Synonyms:
2-(4-tert-butyl-2,6-dimethyl-benzyl)-2-imidazoline;hydrochloride 2-[(4-tert-butyl-2,6-dimethylphenyl)methyl]-4,5-dihydro-1H-imidazole;hydrochloride MLS000069695 XYLOMETAZOLINE HYDROCHLORIDE cid_5282386
Type:
Small organic molecule
Emp. Form.:
C16H24N2
Mol. Mass.:
244.3752
SMILES:
Cc1cc(cc(C)c1CC1=NCCN1)C(C)(C)C
: