Target
Baculoviral IAP repeat-containing protein 2
Ligand
BDBM32609
Substrate
Meas. Tech.
ChEMBL_1668462 (CHEMBL4018350)
IC50
1.4±n/a nM
Citation
 Manzoni, LSamela, ABarbini, SCairati, SPenconi, MArosio, DLecis, DSeneci, P 4-Connected azabicyclo[5.3.0]decane Smac mimetics-Zn Bioorg Med Chem Lett 27:2336-2344 (2017)  
Target
Name:
Baculoviral IAP repeat-containing protein 2
Synonyms:
API1 BIRC2_HUMAN Cellular inhibitor of apoptosis 1 MIHB | RNF48
Type:
Protein
Mol. Mass.:
69900.47
Organism:
Homo sapiens (Human)
Description:
Q13490
Residue:
618
  
Inhibitor
Name:
BDBM32609
Synonyms:
1-aza-2-oxobicyclo[5.3.0]decane scaffold, 36b
Type:
Small organic molecule
Emp. Form.:
C36H43N5O4
Mol. Mass.:
609.7577
SMILES:
CC[C@H](NC)C(=O)N[C@H]1[C@@H](CNC(=O)c2ccccc2)CC[C@H]2CC[C@H](N2C1=O)C(=O)NC(c1ccccc1)c1ccccc1
: