Target
Baculoviral IAP repeat-containing protein 2
Ligand
BDBM50240589
Substrate
Meas. Tech.
ChEMBL_1668462 (CHEMBL4018350)
IC50
1.5±n/a nM
Citation
 Manzoni, LSamela, ABarbini, SCairati, SPenconi, MArosio, DLecis, DSeneci, P 4-Connected azabicyclo[5.3.0]decane Smac mimetics-Zn Bioorg Med Chem Lett 27:2336-2344 (2017)  
Target
Name:
Baculoviral IAP repeat-containing protein 2
Synonyms:
API1 BIRC2_HUMAN Cellular inhibitor of apoptosis 1 MIHB | RNF48
Type:
Protein
Mol. Mass.:
69900.47
Organism:
Homo sapiens (Human)
Description:
Q13490
Residue:
618
  
Inhibitor
Name:
BDBM50240589
Synonyms:
CHEMBL4091245
Type:
Small organic molecule
Emp. Form.:
C43H52N8O4
Mol. Mass.:
744.9242
SMILES:
[H][C@]12CC[C@H](N1C(=O)[C@@H](NC(=O)[C@H](CC)NC)[C@@H](CNC(=O)CN(Cc1ccccn1)Cc1ccccn1)CC2)C(=O)NC(c1ccccc1)c1ccccc1
: