Target
Vasopressin V1a receptor
Ligand
BDBM50240649
Substrate
Meas. Tech.
ChEMBL_1668475 (CHEMBL4018363)
EC50
0.650±n/a nM
Citation
 Adachi, YSakimura, KShimizu, YNakayama, MTerao, YYano, TAsami, T Potent and selective oxytocin receptor agonists without disulfide bridges. Bioorg Med Chem Lett 27:2331-2335 (2017)  
Target
Name:
Vasopressin V1a receptor
Synonyms:
AVPR V1a AVPR1A V1AR_HUMAN VASOPRESSIN V1A Vasopressin V1 receptor Vasopressin receptor
Type:
Receptor
Mol. Mass.:
46820.18
Organism:
Homo sapiens (Human)
Description:
P37288
Residue:
418
  
Inhibitor
Name:
BDBM50240649
Synonyms:
CHEMBL4063150
Type:
Small organic molecule
Emp. Form.:
C40H59N11O13S2
Mol. Mass.:
966.092
SMILES:
CC[C@H](C)[C@@H]1NC(=O)[C@H](Cc2ccc(O)cc2)NC(=O)CCSSC[C@H](NC(=O)[C@H](CC(N)=O)NC(=O)[C@H](CCC(N)=O)NC1=O)C(=O)N1CCC[C@H]1C(=O)N[C@@H](CO)C(=O)NCC(N)=O
: