Target
Adenosine receptor A1
Ligand
BDBM50304639
Substrate
Meas. Tech.
ChEBML_1669044
Ki
159±n/a nM
Citation
 Yu, JAhn, SKim, HJLee, MAhn, SKim, JJin, SHLee, EKim, GCheong, JHJacobson, KAJeong, LSNoh, M Polypharmacology of N J Med Chem 60:7459-7475 (2017)  
Target
Name:
Adenosine receptor A1
Synonyms:
A1 adenosine receptor (hA1) AA1R_HUMAN ADORA1 Adenosine A1-receptor Adenosine receptor A1 (hA1) | Adenosine transporter (AdT)
Type:
G Protein-Coupled Receptor (GPCR)
Mol. Mass.:
36520.92
Organism:
Homo sapiens (Human)
Description:
P30542
Residue:
326
  
Inhibitor
Name:
BDBM50304639
Synonyms:
9-(5'-Cyclopropylmethylaminocarbonyl-4'-thio-beta-D-ribofuranosyl)-N6-(3-iodobenzyl)adenine | CHEMBL603424
Type:
Small organic molecule
Emp. Form.:
C21H23IN6O3S
Mol. Mass.:
566.415
SMILES:
O[C@H]1[C@@H](O)[C@@H](S[C@@H]1C(=O)NCC1CC1)n1cnc2c(NCc3cccc(I)c3)ncnc12
: