Target
Metabotropic glutamate receptor 5
Ligand
BDBM50240893
Substrate
Meas. Tech.
ChEMBL_1669256 (CHEMBL4019144)
IC50
94±n/a nM
Citation
 Stepan, AFClaffey, MMReese, MRBalan, GBarreiro, GBarricklow, JBohanon, MJBoscoe, BPCappon, GDChenard, LKCianfrogna, JChen, LCoffman, KJDrozda, SEDunetz, JRGhosh, SHou, XHoule, CKarki, KLazzaro, JTMancuso, JYMarcek, JMMiller, ELMoen, MAO'Neil, SSakurada, ISkaddan, MParikh, VSmith, DLTrapa, PTuttle, JBVerhoest, PRWalker, DPWon, AWright, ASWhritenour, JZasadny, KZaleska, MMZhang, LShaffer, CL Discovery and Characterization of (R)-6-Neopentyl-2-(pyridin-2-ylmethoxy)-6,7-dihydropyrimido[2,1-c][1,4]oxazin-4(9H)-one (PF-06462894), an Alkyne-Lacking Metabotropic Glutamate Receptor 5 Negative Allosteric Modulator Profiled in both Rat and Nonhuman Primates. J Med Chem 60:7764-7780 (2017)  
Target
Name:
Metabotropic glutamate receptor 5
Synonyms:
GRM5_RAT Grm5 Mglur5 metabotropic glutamate 5/1-C metabotropic glutamate 5a
Type:
Enzyme
Mol. Mass.:
131900.14
Organism:
Rattus norvegicus (Rat)
Description:
P31424
Residue:
1203
  
Inhibitor
Name:
BDBM50240893
Synonyms:
CHEMBL4072424
Type:
Small organic molecule
Emp. Form.:
C19H22N2O3
Mol. Mass.:
326.3896
SMILES:
O=c1cc(OCCC2CC2)nc2COC[C@@H](Cc3ccccc3)n12
: