Target
Aldo-keto reductase family 1 member A1
Ligand
BDBM50241828
Substrate
Meas. Tech.
ChEMBL_1670543 (CHEMBL4020431)
IC50
1700±n/a nM
Citation
 Endo, SXia, SSuyama, MMorikawa, YOguri, HHu, DAo, YTakahara, SHorino, YHayakawa, YWatanabe, YGouda, HHara, AKuwata, KToyooka, NMatsunaga, TIkari, A Synthesis of Potent and Selective Inhibitors of Aldo-Keto Reductase 1B10 and Their Efficacy against Proliferation, Metastasis, and Cisplatin Resistance of Lung Cancer Cells. J Med Chem 60:8441-8455 (2017)  
Target
Name:
Aldo-keto reductase family 1 member A1
Synonyms:
AK1A1_HUMAN ALDR1 Alcohol dehydrogenase [NADP+] Aldehyde reductase | Aldo-keto reductase family 1 member A1
Type:
Enzyme
Mol. Mass.:
36574.11
Organism:
Homo sapiens (Human)
Description:
Residue:
325
  
Inhibitor
Name:
BDBM50241828
Synonyms:
CHEMBL4089817
Type:
Small organic molecule
Emp. Form.:
C19H16FNO4
Mol. Mass.:
341.333
SMILES:
Oc1ccc2cc(C(=O)NCCCc3ccc(F)cc3)c(=O)oc2c1
: