Target
Lysine-specific histone demethylase 1A
Ligand
BDBM50242956
Substrate
Meas. Tech.
ChEMBL_1672382 (CHEMBL4022411)
Kd
120±n/a nM
Citation
 Mould, DPBremberg, UJordan, AMGeitmann, MMaiques-Diaz, AMcGonagle, AESmall, HFSomervaille, TCPOgilvie, D Development of 5-hydroxypyrazole derivatives as reversible inhibitors of lysine specific demethylase 1. Bioorg Med Chem Lett 27:3190-3195 (2017)  
Target
Name:
Lysine-specific histone demethylase 1A
Synonyms:
AOF2 Flavin-containing amine oxidase domain-containing protein 2 KDM1A KIAA0601 Lysine-specific demethylase 1 (LSD1) Lysine-specific histone demethylase 1 (LSD1)
Type:
Enzyme
Mol. Mass.:
92901.01
Organism:
Homo sapiens (Human)
Description:
O60341
Residue:
852
  
Inhibitor
Name:
BDBM50242956
Synonyms:
CHEMBL4085581
Type:
Small organic molecule
Emp. Form.:
C20H22N8O2
Mol. Mass.:
406.4411
SMILES:
Cn1cnc(COc2cc(nn2-c2ccc(cc2)C#N)C(=O)N2CCC[C@@H](N)C2)n1
: