Target
Lysine-specific histone demethylase 1A
Ligand
BDBM50242952
Substrate
Meas. Tech.
ChEMBL_1672382 (CHEMBL4022411)
Kd
22±n/a nM
Citation
 Mould, DPBremberg, UJordan, AMGeitmann, MMaiques-Diaz, AMcGonagle, AESmall, HFSomervaille, TCPOgilvie, D Development of 5-hydroxypyrazole derivatives as reversible inhibitors of lysine specific demethylase 1. Bioorg Med Chem Lett 27:3190-3195 (2017)  
Target
Name:
Lysine-specific histone demethylase 1A
Synonyms:
AOF2 Flavin-containing amine oxidase domain-containing protein 2 KDM1A KIAA0601 Lysine-specific demethylase 1 (LSD1) Lysine-specific histone demethylase 1 (LSD1)
Type:
Enzyme
Mol. Mass.:
92901.01
Organism:
Homo sapiens (Human)
Description:
O60341
Residue:
852
  
Inhibitor
Name:
BDBM50242952
Synonyms:
CHEMBL4088035
Type:
Small organic molecule
Emp. Form.:
C21H27N5O3
Mol. Mass.:
397.4708
SMILES:
CC(C)(O)CCOc1cc(nn1-c1ccc(cc1)C#N)C(=O)N1CCC[C@@H](N)C1
: