Target
Sialidase A
Ligand
BDBM50303147
Substrate
Meas. Tech.
ChEMBL_1672428 (CHEMBL4022457)
Ki
1300±n/a nM
Citation
 Park, JYHwan Lim, SRam Kim, BJae Jeong, HKwon, HJSong, GYBae Ryu, YSong Lee, W Sialidase inhibitory activity of diarylnonanoid and neolignan compounds extracted from the seeds of Myristica fragrans. Bioorg Med Chem Lett 27:3060-3064 (2017)  
Target
Name:
Sialidase A
Synonyms:
NANA_STREE Sialidase A | nanA
Type:
Enzyme
Mol. Mass.:
114737.08
Organism:
Streptococcus pneumoniae
Description:
P62576; spr1536
Residue:
1035
  
Inhibitor
Name:
BDBM50303147
Synonyms:
(-)-licarin B | CHEMBL578403
Type:
Small organic molecule
Emp. Form.:
C20H20O4
Mol. Mass.:
324.3704
SMILES:
COc1cc(\C=C\C)cc2[C@H](C)[C@H](Oc12)c1ccc2OCOc2c1
: