Target
Chitotriosidase-1
Ligand
BDBM50243800
Substrate
Meas. Tech.
ChEMBL_1672913 (CHEMBL4022942)
IC50
15650±n/a nM
Citation
 Mazur, MOlczak, JOlejniczak, SKoralewski, RCzestkowski, WJedrzejczak, AGolab, JDzwonek, KDymek, BSklepkiewicz, PLZagozdzon, ANoonan, TMahboubi, KConway, BSheeler, RBeckett, PHungerford, WMPodjarny, AMitschler, ACousido-Siah, AFadel, FGolebiowski, A Targeting Acidic Mammalian chitinase Is Effective in Animal Model of Asthma. J Med Chem 61:695-710 (2018)  
Target
Name:
Chitotriosidase-1
Synonyms:
3.2.1.14 Chit1 Chitotriosidase-1
Type:
PROTEIN
Mol. Mass.:
51108.04
Organism:
Mus musculus
Description:
ChEMBL_117450
Residue:
464
  
Inhibitor
Name:
BDBM50243800
Synonyms:
CHEMBL4075848
Type:
Small organic molecule
Emp. Form.:
C18H27ClN6
Mol. Mass.:
362.9
SMILES:
CC(C)N(CCc1ccc(Cl)cc1)C1CCN(CC1)c1nc(N)n[nH]1
: