Target
Nucleotide-binding oligomerization domain-containing protein 2
Ligand
BDBM50245075
Substrate
Meas. Tech.
ChEMBL_1674488 (CHEMBL4024517)
EC50
276±n/a nM
Citation
 Gobec, MToma?i?, T?timac, AFrkanec, RTrontelj, JAnderluh, MMlinari?-Ra??an, IJakopin, ? Discovery of Nanomolar Desmuramylpeptide Agonists of the Innate Immune Receptor Nucleotide-Binding Oligomerization Domain-Containing Protein 2 (NOD2) Possessing Immunostimulatory Properties. J Med Chem 61:2707-2724 (2018)  
Target
Name:
Nucleotide-binding oligomerization domain-containing protein 2
Synonyms:
CARD15 IBD1 NOD2 Nucleotide-binding oligomerization domain-containing protein 2 | nucleotide-binding oligomerization domain containing 2
Type:
PROTEIN
Mol. Mass.:
115287.18
Organism:
Homo sapiens (Human)
Description:
ChEMBL_1454053
Residue:
1040
  
Inhibitor
Name:
BDBM50245075
Synonyms:
CHEMBL4088641
Type:
Small organic molecule
Emp. Form.:
C30H35F2N3O7
Mol. Mass.:
587.6116
SMILES:
CCOC(=O)CC[C@@H](NC(=O)[C@H](Cc1ccccc1)NC(=O)CNC(=O)C1CC1c1ccc(F)c(F)c1)C(=O)OCC
: