Target
Calpain-1 catalytic subunit
Ligand
BDBM50245477
Substrate
Meas. Tech.
ChEMBL_1674674 (CHEMBL4024817)
IC50
3.0±n/a nM
Citation
 Jackson, PAWiden, JCHarki, DABrummond, KM Covalent Modifiers: A Chemical Perspective on the Reactivity of?,?-Unsaturated Carbonyls with Thiols via Hetero-Michael Addition Reactions. J Med Chem 60:839-885 (2017)  
Target
Name:
Calpain-1 catalytic subunit
Synonyms:
CAN1_HUMAN CAPN1 Calpain-1 (u-Calpain) Calpain1
Type:
Protein
Mol. Mass.:
81880.51
Organism:
Homo sapiens (Human)
Description:
Residue:
714
  
Inhibitor
Name:
BDBM50245477
Synonyms:
CHEMBL4073900
Type:
Small organic molecule
Emp. Form.:
C48H75N7O13
Mol. Mass.:
958.1482
SMILES:
CCCCCC\C=C/CC(=O)N[C@@H](CO)C(=O)N[C@@H](C(C)C)C(=O)N[C@@H](CO)[C@@H](O)CC(=O)N[C@@H](C(C)C)C(=O)N[C@H]1COC(=O)[C@H](Cc2ccc(O)cc2)N(C)C(=O)[C@@H](NC(=O)\C=C\1)C(C)C
: