Target
Steroid 17-alpha-hydroxylase/17,20 lyase
Ligand
BDBM25458
Substrate
Meas. Tech.
ChEMBL_1675507 (CHEMBL4025650)
IC50
25±n/a nM
Citation
 Wang, MFang, YGu, SChen, FZhu, ZSun, XZhu, J Discovery of novel 1,2,3,4-tetrahydrobenzo[4, 5]thieno[2, 3-c]pyridine derivatives as potent and selective CYP17 inhibitors. Eur J Med Chem 132:157-172 (2017)  
Target
Name:
Steroid 17-alpha-hydroxylase/17,20 lyase
Synonyms:
CP17A_RAT Cyp17a1 Cytochrome P450 17A1 Steroid 17-alpha-hydroxylase/17,20 lyase
Type:
Enzyme
Mol. Mass.:
57255.68
Organism:
Rattus norvegicus (Rat)
Description:
P11715
Residue:
507
  
Inhibitor
Name:
BDBM25458
Synonyms:
(1S,2R,5S,10R,11S,15S)-2,15-dimethyl-14-(pyridin-3-yl)tetracyclo[8.7.0.0^{2,7}.0^{11,15}]heptadeca-7,13-dien-5-ol Abiraterone CHEMBL254328 US9611270, Example 5, abiraterone
Type:
steroidal compound
Emp. Form.:
C24H31NO
Mol. Mass.:
349.509
SMILES:
[H][C@@]12CC=C(c3cccnc3)[C@@]1(C)CC[C@@]1([H])[C@@]2([H])CC=C2C[C@@H](O)CC[C@]12C
: