Target
ATP-binding cassette sub-family C member 2
Ligand
BDBM50027886
Substrate
Meas. Tech.
ChEMBL_1678645 (CHEMBL4028922)
IC50
>133000±n/a nM
Citation
 Morgan, REvan Staden, CJChen, YKalyanaraman, NKalanzi, JDunn, RTAfshari, CAHamadeh, HK A multifactorial approach to hepatobiliary transporter assessment enables improved therapeutic compound development. Toxicol Sci 136:216-41 (2013)  
Target
Name:
ATP-binding cassette sub-family C member 2
Synonyms:
ABCC2 CMOAT CMRP Canalicular multispecific organic anion transporter 1 MRP2 Multidrug resistance-associated protein 2 Multidrug resistance-associated protein 3 (MRP3)
Type:
Protein
Mol. Mass.:
174229.45
Organism:
Homo sapiens (Human)
Description:
Q92887
Residue:
1545
  
Inhibitor
Name:
BDBM50027886
Synonyms:
1-Butyl-3-(p-methylphenylsulfonyl)urea 1-Butyl-3-tosylurea N-(4-Methylphenylsulfonyl)-N'-butylurea N-Butyl-N'-(p-tolylsulfonyl)urea N-n-Butyl-N'-tosylurea TOLBUTAMIDE
Type:
Small organic molecule
Emp. Form.:
C12H18N2O3S
Mol. Mass.:
270.348
SMILES:
CCCCNC(=O)NS(=O)(=O)c1ccc(C)cc1
: