Target
ATP-binding cassette sub-family C member 2
Ligand
BDBM50240437
Substrate
Meas. Tech.
ChEMBL_1678645 (CHEMBL4028922)
IC50
>133000±n/a nM
Citation
 Morgan, REvan Staden, CJChen, YKalyanaraman, NKalanzi, JDunn, RTAfshari, CAHamadeh, HK A multifactorial approach to hepatobiliary transporter assessment enables improved therapeutic compound development. Toxicol Sci 136:216-41 (2013)  
Target
Name:
ATP-binding cassette sub-family C member 2
Synonyms:
ABCC2 CMOAT CMRP Canalicular multispecific organic anion transporter 1 MRP2 Multidrug resistance-associated protein 2 Multidrug resistance-associated protein 3 (MRP3)
Type:
Protein
Mol. Mass.:
174229.45
Organism:
Homo sapiens (Human)
Description:
Q92887
Residue:
1545
  
Inhibitor
Name:
BDBM50240437
Synonyms:
(-)-17-(cyclobutylmethyl)morphinan-3,14-diol (-)-butorphanol BUTORPHANOL US10231963, Table B.3 US11534436, Compound Table B.3 | US9656961, Example 00120
Type:
Small organic molecule
Emp. Form.:
C21H29NO2
Mol. Mass.:
327.4605
SMILES:
Oc1ccc2C[C@H]3N(CC4CCC4)CC[C@@]4(CCCC[C@@]34O)c2c1
: