Target
NUAK family SNF1-like kinase 1
Ligand
BDBM50248938
Substrate
Meas. Tech.
ChEMBL_1679548 (CHEMBL4029825)
Ki
8.6±n/a nM
Citation
 Edupuganti, RTaliaferro, JMWang, QXie, XCho, EJVidhu, FRen, PAnslyn, EVBartholomeusz, CDalby, KN Discovery of a potent inhibitor of MELK that inhibits expression of the anti-apoptotic protein Mcl-1 and TNBC cell growth. Bioorg Med Chem 25:2609-2616 (2017)  
Target
Name:
NUAK family SNF1-like kinase 1
Synonyms:
ARK5 NUAK1 OMPHK1
Type:
PROTEIN
Mol. Mass.:
74326.51
Organism:
Homo sapiens (Human)
Description:
ChEMBL_1451343
Residue:
661
  
Inhibitor
Name:
BDBM50248938
Synonyms:
CHEMBL4089284 | US10981896, Compound 21
Type:
Small organic molecule
Emp. Form.:
C30H31N5O4
Mol. Mass.:
525.5982
SMILES:
CN(C(=O)CN1CCN(C)CC1)c1ccc(N\C(=C2/C(=O)Nc3ccc(cc23)C(O)=O)c2ccccc2)cc1
: