Target
Prostaglandin G/H synthase 1
Ligand
BDBM50249111
Substrate
Meas. Tech.
ChEMBL_1679729 (CHEMBL4030006)
IC50
88±n/a nM
Citation
 Ghareb, NElshihawy, HAAbdel-Daim, MMHelal, MA Novel pyrazoles and pyrazolo[1,2-a]pyridazines as selective COX-2 inhibitors; Ultrasound-assisted synthesis, biological evaluation, and DFT calculations. Bioorg Med Chem Lett 27:2377-2383 (2017)  
Target
Name:
Prostaglandin G/H synthase 1
Synonyms:
COX-1 Cyclooxygenase Cyclooxygenase-1 (COX-1) PTGS1 | Prostaglandin G/H synthase (cyclooxygenase)
Type:
Enzyme
Mol. Mass.:
68692.62
Organism:
Homo sapiens (Human)
Description:
P23219
Residue:
599
  
Inhibitor
Name:
BDBM50249111
Synonyms:
CHEMBL4086962
Type:
Small organic molecule
Emp. Form.:
C16H17N3O5
Mol. Mass.:
331.3233
SMILES:
CCOC(=O)C1=C(N)N2N(C1c1ccccc1O)C(=O)CCC2=O
: