Target
Prostaglandin G/H synthase 2
Ligand
BDBM50249138
Substrate
Meas. Tech.
ChEMBL_1679730 (CHEMBL4030007)
IC50
130±n/a nM
Citation
 Ghareb, NElshihawy, HAAbdel-Daim, MMHelal, MA Novel pyrazoles and pyrazolo[1,2-a]pyridazines as selective COX-2 inhibitors; Ultrasound-assisted synthesis, biological evaluation, and DFT calculations. Bioorg Med Chem Lett 27:2377-2383 (2017)  
Target
Name:
Prostaglandin G/H synthase 2
Synonyms:
COX2 Cyclooxygenase 2 (COX-2) Cyclooxygenase-2 (COX-2 AA) Cyclooxygenase-2 (COX-2) PGH2_HUMAN PHS II Prostaglandin E synthase/G/H synthase 2 Prostaglandin-endoperoxide synthase 2
Type:
Enzyme
Mol. Mass.:
69003.89
Organism:
Homo sapiens (Human)
Description:
Recombinant Cox-2 provided by Cayman (Cayman Chemical Co.,Ann Arbor, MI).
Residue:
604
  
Inhibitor
Name:
BDBM50249138
Synonyms:
CHEMBL4103357
Type:
Small organic molecule
Emp. Form.:
C15H10N2O4
Mol. Mass.:
282.2509
SMILES:
Oc1ccccc1C(=O)NN1C(=O)c2ccccc2C1=O
: