Target
Retinal rod rhodopsin-sensitive cGMP 3',5'-cyclic phosphodiesterase subunit delta
Ligand
BDBM50249989
Substrate
Meas. Tech.
ChEBML_1680835
Kd
2.2±n/a nM
Citation
 Jiang, YZhuang, CChen, LLu, JDong, GMiao, ZZhang, WLi, JSheng, C Structural Biology-Inspired Discovery of Novel KRAS-PDE? Inhibitors. J Med Chem 60:9400-9406 (2017)  
Target
Name:
Retinal rod rhodopsin-sensitive cGMP 3',5'-cyclic phosphodiesterase subunit delta
Synonyms:
3',5'-cyclic phosphodiesterase PDE6D PDED Retinal rod rhodopsin-sensitive cGMP 3',5'-cyclic phosphodiesterase subunit delta
Type:
PROTEIN
Mol. Mass.:
17418.30
Organism:
Homo sapiens (Human)
Description:
ChEMBL_105761
Residue:
150
  
Inhibitor
Name:
BDBM50249989
Synonyms:
CHEMBL1387422
Type:
Small organic molecule
Emp. Form.:
C27H31N5O2
Mol. Mass.:
457.5673
SMILES:
CC(CNC(=O)CCCn1nc(C)c2c(C)n(nc2c1=O)-c1ccc(C)cc1)c1ccccc1
: