Target
Sodium- and chloride-dependent betaine transporter
Ligand
BDBM50250293
Substrate
Meas. Tech.
ChEMBL_1681424 (CHEMBL4031701)
IC50
34000±n/a nM
Citation
 Jørgensen, LAl-Khawaja, AKickinger, SVogensen, SBSkovgaard-Petersen, JRosenthal, EBorkar, NLöffler, RMadsen, KKBräuner-Osborne, HSchousboe, AEcker, GFWellendorph, PClausen, RP Structure-Activity Relationship, Pharmacological Characterization, and Molecular Modeling of Noncompetitive Inhibitors of the Betaine/?-Aminobutyric Acid Transporter 1 (BGT1). J Med Chem 60:8834-8846 (2017)  
Target
Name:
Sodium- and chloride-dependent betaine transporter
Synonyms:
GABA transporter Gabt2 Gat2 Slc6a12
Type:
PROTEIN
Mol. Mass.:
69615.88
Organism:
Mus musculus
Description:
ChEMBL_1460088
Residue:
614
  
Inhibitor
Name:
BDBM50250293
Synonyms:
CHEMBL4104682
Type:
Small organic molecule
Emp. Form.:
C19H19Cl2FN2O
Mol. Mass.:
381.271
SMILES:
Fc1cccc(CN2CCC(CC2)NC(=O)c2ccc(Cl)cc2Cl)c1
: