Target
Sodium- and chloride-dependent betaine transporter
Ligand
BDBM50250321
Substrate
Meas. Tech.
ChEBML_1681420
IC50
>50000±n/a nM
Citation
 Jørgensen, LAl-Khawaja, AKickinger, SVogensen, SBSkovgaard-Petersen, JRosenthal, EBorkar, NLöffler, RMadsen, KKBräuner-Osborne, HSchousboe, AEcker, GFWellendorph, PClausen, RP Structure-Activity Relationship, Pharmacological Characterization, and Molecular Modeling of Noncompetitive Inhibitors of the Betaine/?-Aminobutyric Acid Transporter 1 (BGT1). J Med Chem 60:8834-8846 (2017)  
Target
Name:
Sodium- and chloride-dependent betaine transporter
Synonyms:
Betaine transporter SLC6A12
Type:
PROTEIN
Mol. Mass.:
69366.52
Organism:
Homo sapiens (Human)
Description:
ChEMBL_1454199
Residue:
614
  
Inhibitor
Name:
BDBM50250321
Synonyms:
CHEMBL4097124
Type:
Small organic molecule
Emp. Form.:
C22H21Cl2N3O
Mol. Mass.:
414.328
SMILES:
Clc1ccc(C(=O)NC2CCN(Cc3ccc4ccccc4n3)CC2)c(Cl)c1
: