Target
Sodium- and chloride-dependent GABA transporter 2
Ligand
BDBM50250267
Substrate
Meas. Tech.
ChEBML_1681421
Ki
>100000±n/a nM
Citation
 Jørgensen, LAl-Khawaja, AKickinger, SVogensen, SBSkovgaard-Petersen, JRosenthal, EBorkar, NLöffler, RMadsen, KKBräuner-Osborne, HSchousboe, AEcker, GFWellendorph, PClausen, RP Structure-Activity Relationship, Pharmacological Characterization, and Molecular Modeling of Noncompetitive Inhibitors of the Betaine/?-Aminobutyric Acid Transporter 1 (BGT1). J Med Chem 60:8834-8846 (2017)  
Target
Name:
Sodium- and chloride-dependent GABA transporter 2
Synonyms:
GABA transporter 2 S6A13_HUMAN | SLC6A13
Type:
PROTEIN
Mol. Mass.:
68012.63
Organism:
Homo sapiens (Human)
Description:
ChEMBL_1454197
Residue:
602
  
Inhibitor
Name:
BDBM50250267
Synonyms:
CHEMBL1882801
Type:
Small organic molecule
Emp. Form.:
C19H20Cl2N2O
Mol. Mass.:
363.281
SMILES:
Clc1ccc(C(=O)NC2CCN(Cc3ccccc3)CC2)c(Cl)c1
: