Target
Sodium- and chloride-dependent GABA transporter 1
Ligand
BDBM50250301
Substrate
Meas. Tech.
ChEBML_1681419
Ki
>100000±n/a nM
Citation
 Jørgensen, LAl-Khawaja, AKickinger, SVogensen, SBSkovgaard-Petersen, JRosenthal, EBorkar, NLöffler, RMadsen, KKBräuner-Osborne, HSchousboe, AEcker, GFWellendorph, PClausen, RP Structure-Activity Relationship, Pharmacological Characterization, and Molecular Modeling of Noncompetitive Inhibitors of the Betaine/?-Aminobutyric Acid Transporter 1 (BGT1). J Med Chem 60:8834-8846 (2017)  
Target
Name:
Sodium- and chloride-dependent GABA transporter 1
Synonyms:
GABA transporter 1 GABT1 GAT1 SLC6A1 Solute carrier family 6 member 1
Type:
PROTEIN
Mol. Mass.:
67079.40
Organism:
Homo sapiens (Human)
Description:
ChEMBL_1454196
Residue:
599
  
Inhibitor
Name:
BDBM50250301
Synonyms:
CHEMBL4068983
Type:
Small organic molecule
Emp. Form.:
C20H22N2O3
Mol. Mass.:
338.4003
SMILES:
O=C(NC1CCN(Cc2ccccc2)CC1)c1ccc2OCOc2c1
: