Target
Sodium- and chloride-dependent betaine transporter
Ligand
BDBM50250297
Substrate
Meas. Tech.
ChEBML_1681424
IC50
30200±n/a nM
Citation
 Jørgensen, LAl-Khawaja, AKickinger, SVogensen, SBSkovgaard-Petersen, JRosenthal, EBorkar, NLöffler, RMadsen, KKBräuner-Osborne, HSchousboe, AEcker, GFWellendorph, PClausen, RP Structure-Activity Relationship, Pharmacological Characterization, and Molecular Modeling of Noncompetitive Inhibitors of the Betaine/?-Aminobutyric Acid Transporter 1 (BGT1). J Med Chem 60:8834-8846 (2017)  
Target
Name:
Sodium- and chloride-dependent betaine transporter
Synonyms:
GABA transporter Gabt2 Gat2 Slc6a12
Type:
PROTEIN
Mol. Mass.:
69615.88
Organism:
Mus musculus
Description:
ChEMBL_1460088
Residue:
614
  
Inhibitor
Name:
BDBM50250297
Synonyms:
CHEMBL4083481
Type:
Small organic molecule
Emp. Form.:
C21H24Cl2N2O3
Mol. Mass.:
423.333
SMILES:
COc1cc(CN2CCC(CC2)NC(=O)c2ccc(Cl)cc2Cl)cc(OC)c1
: