Target
Growth factor receptor-bound protein 7
Ligand
BDBM50250517
Substrate
Meas. Tech.
ChEMBL_1681824 (CHEMBL4032101)
Kd
1100±n/a nM
Citation
 Watson, GMKulkarni, KSang, JMa, XGunzburg, MJPerlmutter, PWilce, MCJWilce, JA Discovery, Development, and Cellular Delivery of Potent and Selective Bicyclic Peptide Inhibitors of Grb7 Cancer Target. J Med Chem 60:9349-9359 (2017)  
Target
Name:
Growth factor receptor-bound protein 7
Synonyms:
B47 GRB7 GRB7_HUMAN
Type:
PROTEIN
Mol. Mass.:
59700.56
Organism:
Homo sapiens (Human)
Description:
ChEMBL_699661
Residue:
532
  
Inhibitor
Name:
BDBM50250517
Synonyms:
CHEMBL4072970
Type:
Small organic molecule
Emp. Form.:
C49H64N12O17S
Mol. Mass.:
1125.168
SMILES:
NC(=O)C[C@@H]1NC(=O)[C@H](CC(O)=O)NC(=O)[C@H](Cc2ccc(O)cc2)NC(=O)CNC(=O)[C@H](CCC(O)=O)NC(=O)[C@H](Cc2ccccc2)NC(=O)[C@@H]2CCCCNC(=O)CC[C@H](NC1=O)C(=O)N[C@@H](CSCC(=O)N2)C(N)=O
: