Target
Growth factor receptor-bound protein 7
Ligand
BDBM50250522
Substrate
Meas. Tech.
ChEMBL_1681823 (CHEMBL4032100)
Kd
3030±n/a nM
Citation
 Watson, GMKulkarni, KSang, JMa, XGunzburg, MJPerlmutter, PWilce, MCJWilce, JA Discovery, Development, and Cellular Delivery of Potent and Selective Bicyclic Peptide Inhibitors of Grb7 Cancer Target. J Med Chem 60:9349-9359 (2017)  
Target
Name:
Growth factor receptor-bound protein 7
Synonyms:
B47 GRB7 GRB7_HUMAN
Type:
PROTEIN
Mol. Mass.:
59700.56
Organism:
Homo sapiens (Human)
Description:
ChEMBL_699661
Residue:
532
  
Inhibitor
Name:
BDBM50250522
Synonyms:
CHEMBL4083407
Type:
Small organic molecule
Emp. Form.:
C49H62N14O17S
Mol. Mass.:
1151.165
SMILES:
NC(=O)C[C@@H]1NC(=O)[C@H](CC(O)=O)NC(=O)[C@H](Cc2ccc(O)cc2)NC(=O)CNC(=O)[C@H](CCC(O)=O)NC(=O)[C@H](Cc2ccccc2)NC(=O)[C@@H]2COCc3cn(CCC[C@H](NC1=O)C(=O)N[C@@H](CSCC(=O)N2)C(N)=O)nn3
: