Target
Nitric oxide synthase, brain
Ligand
BDBM190667
Substrate
Meas. Tech.
ChEBML_1681884
Ki
13±n/a nM
Citation
 Do, HTWang, HYLi, HChreifi, GPoulos, TLSilverman, RB Improvement of Cell Permeability of Human Neuronal Nitric Oxide Synthase Inhibitors Using Potent and Selective 2-Aminopyridine-Based Scaffolds with a Fluorobenzene Linker. J Med Chem 60:9360-9375 (2017)  
Target
Name:
Nitric oxide synthase, brain
Synonyms:
Constitutive NOS NC-NOS NOS type I nNOS NOS1_HUMAN Neuronal nitric oxide synthase Nitric oxide synthase, neuronal (nNOS) bNOS | nNOS
Type:
Homodimer
Mol. Mass.:
160985.98
Organism:
Homo sapiens (Human)
Description:
P29475
Residue:
1434
  
Inhibitor
Name:
BDBM190667
Synonyms:
US10759791, Compound 14j | nNOS inhibitor, 5
Type:
Small organic molecule
Emp. Form.:
C17H24N4
Mol. Mass.:
284.3993
SMILES:
CNCCCc1cncc(CCc2cc(C)cc(N)n2)c1
: