Target
L-lactate dehydrogenase A chain
Ligand
BDBM50250677
Substrate
Meas. Tech.
ChEMBL_1682048 (CHEMBL4032325)
Kd
0.330000±n/a nM
Citation
 Rai, GBrimacombe, KRMott, BTUrban, DJHu, XYang, SMLee, TDCheff, DMKouznetsova, JBenavides, GAPohida, KKuenstner, EJLuci, DKLukacs, CMDavies, DRDranow, DMZhu, HSulikowski, GMoore, WJStott, GMFlint, AJHall, MDDarley-Usmar, VMNeckers, LMDang, CVWaterson, AGSimeonov, AJadhav, AMaloney, DJ Discovery and Optimization of Potent, Cell-Active Pyrazole-Based Inhibitors of Lactate Dehydrogenase (LDH). J Med Chem 60:9184-9204 (2017)  
Target
Name:
L-lactate dehydrogenase A chain
Synonyms:
Cell proliferation-inducing gene 19 protein L-lactate dehydrogenase A Chain LDH-A LDHA Lactate dehydrogenase A (LDHA) | Renal carcinoma antigen NY-REN-59
Type:
Protein
Mol. Mass.:
36694.85
Organism:
Homo sapiens (Human)
Description:
P00338::PDB Code: 4ajp
Residue:
332
  
Inhibitor
Name:
BDBM50250677
Synonyms:
CHEMBL4100845 US11247971, Cmpd ID 52
Type:
Small organic molecule
Emp. Form.:
C29H24N4O4S2
Mol. Mass.:
556.655
SMILES:
NS(=O)(=O)c1ccc(Cc2c(nn(-c3nc(cs3)C(O)=O)c2C2CC2)-c2cccc(c2)-c2ccccc2)cc1
: