Target
L-lactate dehydrogenase A chain
Ligand
BDBM50250667
Substrate
Meas. Tech.
ChEMBL_1682052 (CHEMBL4032329)
IC50
65±n/a nM
Citation
 Rai, GBrimacombe, KRMott, BTUrban, DJHu, XYang, SMLee, TDCheff, DMKouznetsova, JBenavides, GAPohida, KKuenstner, EJLuci, DKLukacs, CMDavies, DRDranow, DMZhu, HSulikowski, GMoore, WJStott, GMFlint, AJHall, MDDarley-Usmar, VMNeckers, LMDang, CVWaterson, AGSimeonov, AJadhav, AMaloney, DJ Discovery and Optimization of Potent, Cell-Active Pyrazole-Based Inhibitors of Lactate Dehydrogenase (LDH). J Med Chem 60:9184-9204 (2017)  
Target
Name:
L-lactate dehydrogenase A chain
Synonyms:
Cell proliferation-inducing gene 19 protein L-lactate dehydrogenase A Chain LDH-A LDHA Lactate dehydrogenase A (LDHA) | Renal carcinoma antigen NY-REN-59
Type:
Protein
Mol. Mass.:
36694.85
Organism:
Homo sapiens (Human)
Description:
P00338::PDB Code: 4ajp
Residue:
332
  
Inhibitor
Name:
BDBM50250667
Synonyms:
CHEMBL4075666 US11247971, Cmpd ID 40
Type:
Small organic molecule
Emp. Form.:
C26H21N5O4S2
Mol. Mass.:
531.606
SMILES:
Nc1c(Cc2ccc(cc2)S(N)(=O)=O)c(nn1-c1nc(cs1)C(O)=O)-c1cccc(c1)-c1ccccc1
: