Target
Lysine-specific demethylase 6A
Ligand
BDBM281138
Substrate
Meas. Tech.
ChEBML_1685362
IC50
>25000±n/a nM
Citation
 Liang, JLabadie, SZhang, BOrtwine, DFPatel, SVinogradova, MKiefer, JRMauer, TGehling, VSHarmange, JCCummings, RLai, TLiao, JZheng, XLiu, YGustafson, AVan der Porten, EMao, WLiederer, BMDeshmukh, GAn, LRan, YClasson, MTrojer, PDragovich, PSMurray, L From a novel HTS hit to potent, selective, and orally bioavailable KDM5 inhibitors. Bioorg Med Chem Lett 27:2974-2981 (2017)  
Target
Name:
Lysine-specific demethylase 6A
Synonyms:
Histone demethylase UTX KDM6A_HUMAN Lysine-specific demethylase 6A (KDM6A(UTX)) UTX Ubiquitously-transcribed X chromosome tetratricopeptide repeat protein
Type:
Protein
Mol. Mass.:
154198.48
Organism:
Homo sapiens (Human)
Description:
O15550
Residue:
1401
  
Inhibitor
Name:
BDBM281138
Synonyms:
US10022354, Example 78
Type:
Small organic molecule
Emp. Form.:
C21H26N6O
Mol. Mass.:
378.4707
SMILES:
CC(C)c1cc([nH]n1)C(=O)N1CCC(C1)c1cc(cc(C)n1)-c1cnn(C)c1
: