Target
Carbonic anhydrase-related protein 11
Ligand
BDBM50253875
Substrate
Meas. Tech.
ChEBML_1685888
Ki
6.1±n/a nM
Citation
 Karal?, NAkdemir, AGökta?, FEraslan Elma, PAngeli, AK?z?l?rmak, MSupuran, CT Novel sulfonamide-containing 2-indolinones that selectively inhibit tumor-associated alpha carbonic anhydrases. Bioorg Med Chem 25:3714-3718 (2017)  
Target
Name:
Carbonic anhydrase-related protein 11
Synonyms:
CA-RP II CA-XI CAH11_HUMAN CARP-2 CARP2 Carbonic anhydrase-related protein 2
Type:
PROTEIN
Mol. Mass.:
36252.43
Organism:
Homo sapiens
Description:
ChEMBL_12954
Residue:
328
  
Inhibitor
Name:
BDBM50253875
Synonyms:
CHEMBL4089415
Type:
Small organic molecule
Emp. Form.:
C15H12BrN5O3S2
Mol. Mass.:
454.321
SMILES:
NS(=O)(=O)c1ccc(NC(=S)N\N=C2/C(=O)Nc3ccc(Br)cc23)cc1
: