Target
Adenosine receptor A1
Ligand
BDBM50259298
Substrate
Meas. Tech.
ChEBML_1691282
Ki
180±n/a nM
Citation
 Poli, DFalsini, MVarano, FBetti, MVarani, KVincenzi, FPugliese, AMPedata, FDal Ben, DThomas, APalchetti, IBettazzi, FCatarzi, DColotta, V Imidazo[1,2-a]pyrazin-8-amine core for the design of new adenosine receptor antagonists: Structural exploration to target the A Eur J Med Chem 125:611-628 (2017)  
Target
Name:
Adenosine receptor A1
Synonyms:
A1 adenosine receptor (hA1) AA1R_HUMAN ADORA1 Adenosine A1-receptor Adenosine receptor A1 (hA1) | Adenosine transporter (AdT)
Type:
G Protein-Coupled Receptor (GPCR)
Mol. Mass.:
36520.92
Organism:
Homo sapiens (Human)
Description:
P30542
Residue:
326
  
Inhibitor
Name:
BDBM50259298
Synonyms:
CHEMBL4105350
Type:
Small organic molecule
Emp. Form.:
C18H14N4
Mol. Mass.:
286.3306
SMILES:
Nc1nc(cn2cc(nc12)-c1ccccc1)-c1ccccc1
: