Target
Mast/stem cell growth factor receptor Kit
Ligand
BDBM50260025
Substrate
Meas. Tech.
ChEBML_1692349
IC50
>10000±n/a nM
Citation
 Wang, ZZhang, YBartual, SGLuo, JXu, TDu, WXun, QTu, ZBrekken, RARen, XBullock, ANLiang, GLu, XDing, K Tetrahydroisoquinoline-7-carboxamide Derivatives as New Selective Discoidin Domain Receptor 1 (DDR1) Inhibitors. ACS Med Chem Lett 8:327-332 (2017)  
Target
Name:
Mast/stem cell growth factor receptor Kit
Synonyms:
CD117 antigen KIT Mast/stem cell growth factor receptor Kit (cKIT) Proto-oncogene tyrosine-protein kinase Kit Stem cell growth factor receptor Tyrosine-protein kinase Kit c-kit v-kit Hardy-Zuckerman 4 feline sarcoma viral oncogene homolog
Type:
Protein
Mol. Mass.:
109869.37
Organism:
Homo sapiens (Human)
Description:
P10721
Residue:
976
  
Inhibitor
Name:
BDBM50260025
Synonyms:
CHEMBL4087485
Type:
Small organic molecule
Emp. Form.:
C28H31F3N6O
Mol. Mass.:
524.5805
SMILES:
CC1CN(Cc2cc(ccc12)C(=O)Nc1cc(CN2CCN(C)CC2)cc(c1)C(F)(F)F)c1cncnc1
: