Target
Epithelial discoidin domain-containing receptor 1
Ligand
BDBM50260041
Substrate
Meas. Tech.
ChEMBL_1692353 (CHEMBL4043002)
Kd
2.2±n/a nM
Citation
 Wang, ZZhang, YBartual, SGLuo, JXu, TDu, WXun, QTu, ZBrekken, RARen, XBullock, ANLiang, GLu, XDing, K Tetrahydroisoquinoline-7-carboxamide Derivatives as New Selective Discoidin Domain Receptor 1 (DDR1) Inhibitors. ACS Med Chem Lett 8:327-332 (2017)  
Target
Name:
Epithelial discoidin domain-containing receptor 1
Synonyms:
CAK DDR1_HUMAN Discoidin domain-containing receptor 1 (DDR1) EDDR1 Epithelial discoidin domain receptor 1 (DDR1) Epithelial discoidin domain-containing receptor 1 (DDR1) Mammary carcinoma kinase 10 NTRK4 Protein-tyrosine kinase RTK 6 TRKE | Tyrosine-protein kinase CAK
Type:
Tyrosine-protein kinase
Mol. Mass.:
101130.02
Organism:
Homo sapiens (Human)
Description:
Q08345
Residue:
913
  
Inhibitor
Name:
BDBM50260041
Synonyms:
CHEMBL4097012
Type:
Small organic molecule
Emp. Form.:
C29H33F3N6O
Mol. Mass.:
538.6071
SMILES:
C[C@H]1CN(Cc2cc(ccc12)C(=O)Nc1cc(CN2CCCN(C)CC2)cc(c1)C(F)(F)F)c1cncnc1
: