Target
Rhodopsin kinase GRK1
Ligand
BDBM50260146
Substrate
Meas. Tech.
ChEBML_1692745
IC50
>100000±n/a nM
Citation
 Waldschmidt, HVHoman, KTCato, MCCruz-Rodríguez, OCannavo, AWilson, MWSong, JCheung, JYKoch, WJTesmer, JJLarsen, SD Structure-Based Design of Highly Selective and Potent G Protein-Coupled Receptor Kinase 2 Inhibitors Based on Paroxetine. J Med Chem 60:3052-3069 (2017)  
Target
Name:
Rhodopsin kinase GRK1
Synonyms:
G protein-coupled receptor kinase 1 GRK1_BOVIN Rhodopsin kinase
Type:
PROTEIN
Mol. Mass.:
62931.24
Organism:
Bos taurus
Description:
ChEMBL_116985
Residue:
561
  
Inhibitor
Name:
BDBM50260146
Synonyms:
CHEMBL4064274
Type:
Small organic molecule
Emp. Form.:
C28H27F3N2O4
Mol. Mass.:
512.5202
SMILES:
Fc1cccc(F)c1CCNC(=O)c1cc(ccc1F)[C@@H]1CCNC[C@H]1COc1ccc2OCOc2c1
: