Target
Polyunsaturated fatty acid 5-lipoxygenase
Ligand
BDBM50240612
Substrate
Meas. Tech.
ChEMBL_1693666 (CHEMBL4044556)
IC50
200000±n/a nM
Citation
 Kaur, RManjal, SKRawal, RKKumar, K Recent synthetic and medicinal perspectives of tryptanthrin. Bioorg Med Chem 25:4533-4552 (2017)  
Target
Name:
Polyunsaturated fatty acid 5-lipoxygenase
Synonyms:
5-LO 5-Lipoxygenase (5-LO) 5-Lipoygenase ALOX5 LOG5 | LOX5_HUMAN
Type:
Enzyme
Mol. Mass.:
77972.74
Organism:
Homo sapiens (Human)
Description:
Recombinant protein was purified from E. coli lysate. After ammonium sulfate precipitation and subsequent steps, the supernatant (S100) was used for 5-LO activity assay.
Residue:
674
  
Inhibitor
Name:
BDBM50240612
Synonyms:
CHEMBL306946 Indolo[2,1-b]quinazoline-6,12-dione TRYPTANTHRIN | US10669273, Compound 5a
Type:
Small organic molecule
Emp. Form.:
C15H8N2O2
Mol. Mass.:
248.2362
SMILES:
O=C1c2ccccc2-n2c1nc1ccccc1c2=O
: