Target
ATP-dependent RNA helicase DDX39A
Ligand
BDBM50260460
Substrate
Meas. Tech.
ChEBML_1693898
IC50
>100000±n/a nM
Citation
 Tillotson, JKedzior, MGuimarães, LRoss, ABPeters, TLAmbrose, AJSchmidlin, CJZhang, DDCosta-Lotufo, LVRodríguez, ADSchatz, JHChapman, E ATP-competitive, marine derived natural products that target the DEAD box helicase, eIF4A. Bioorg Med Chem Lett 27:4082-4085 (2017)  
Target
Name:
ATP-dependent RNA helicase DDX39A
Synonyms:
DDX39 DEAD box protein 39 Nuclear RNA helicase URH49
Type:
PROTEIN
Mol. Mass.:
49121.92
Organism:
Homo sapiens
Description:
ChEMBL_117400
Residue:
427
  
Inhibitor
Name:
BDBM50260460
Synonyms:
ELISABATIN A
Type:
Small organic molecule
Emp. Form.:
C20H22O3
Mol. Mass.:
310.3869
SMILES:
[#6]-[#6@H]-1-[#6]-[#6@@H](\[#6]=[#6](\[#6])-[#6])-[#6]-2=[#6](-[#6])-[#6](=O)-[#6](=O)-c3c(-[#6])cc(-[#8])c-1c-23
: