Target
E3 ubiquitin-protein ligase Mdm2
Ligand
BDBM50261655
Substrate
Meas. Tech.
ChEBML_1696268
Kd
8.6±n/a nM
Citation
 Li, XLiu, CChen, SHu, HSu, JZou, Y d-Amino acid mutation of PMI as potent dual peptide inhibitors of p53-MDM2/MDMX interactions. Bioorg Med Chem Lett 27:4678-4681 (2017)  
Target
Name:
E3 ubiquitin-protein ligase Mdm2
Synonyms:
Double minute 2 protein E3 ubiquitin-protein ligase Mdm2 (p53-binding protein Mdm2) Human Double Minute 2 (HDM2) MDM2-MDMX p53-Binding Protein MDM2 | p53-binding protein
Type:
Oncoprotein
Mol. Mass.:
55196.54
Organism:
Homo sapiens (Human)
Description:
Q00987
Residue:
491
  
Inhibitor
Name:
BDBM50261655
Synonyms:
CHEMBL4090785
Type:
Small organic molecule
Emp. Form.:
C74H98N14O19
Mol. Mass.:
1487.6523
SMILES:
CC(C)C[C@H](NC(=O)[C@H](CC(C)C)NC(=O)[C@H](CC(N)=O)NC(=O)[C@H](Cc1c[nH]c2ccccc12)NC(=O)[C@H](Cc1ccc(O)cc1)NC(=O)[C@H](CCC(O)=O)NC(=O)[C@H](C)NC(=O)[C@H](Cc1ccccc1)NC(=O)[C@H](CO)NC(=O)[C@@H](N)[C@@H](C)O)C(=O)N[C@H](Cc1ccccc1)C(=O)N1CCC[C@H]1C(O)=O
: