Target
Lysine-specific histone demethylase 1A
Ligand
BDBM50262044
Substrate
Meas. Tech.
ChEMBL_1696558 (CHEMBL4047448)
Kd
120±n/a nM
Citation
 Mould, DPBremberg, UJordan, AMGeitmann, MMcGonagle, AESomervaille, TCPSpencer, GJOgilvie, DJ Development and evaluation of 4-(pyrrolidin-3-yl)benzonitrile derivatives as inhibitors of lysine specific demethylase 1. Bioorg Med Chem Lett 27:4755-4759 (2017)  
Target
Name:
Lysine-specific histone demethylase 1A
Synonyms:
AOF2 Flavin-containing amine oxidase domain-containing protein 2 KDM1A KIAA0601 Lysine-specific demethylase 1 (LSD1) Lysine-specific histone demethylase 1 (LSD1)
Type:
Enzyme
Mol. Mass.:
92901.01
Organism:
Homo sapiens (Human)
Description:
O60341
Residue:
852
  
Inhibitor
Name:
BDBM50262044
Synonyms:
CHEMBL4082476
Type:
Small organic molecule
Emp. Form.:
C26H31N3O
Mol. Mass.:
401.5438
SMILES:
Cc1ccc(cc1)[C@@H]1CN(C[C@H]1c1ccc(cc1)C#N)C(=O)C[C@H]1CC[C@H](N)CC1
: