Target
Neuromedin-U receptor 2
Ligand
BDBM50262120
Substrate
Meas. Tech.
ChEBML_1696564
EC50
1.5±n/a nM
Citation
 Nishizawa, NKanematsu-Yamaki, YFunata, MNagai, HShimizu, AFujita, HSakamoto, JTakekawa, SAsami, T A potent neuromedin U receptor 2-selective alkylated peptide. Bioorg Med Chem Lett 27:4626-4629 (2017)  
Target
Name:
Neuromedin-U receptor 2
Synonyms:
G-protein coupled receptor FM-4 NMU-R2 NMU2R NMUR2_HUMAN TGR1
Type:
PROTEIN
Mol. Mass.:
47710.86
Organism:
Homo sapiens (Human)
Description:
ChEMBL_103075
Residue:
415
  
Inhibitor
Name:
BDBM50262120
Synonyms:
CHEMBL4083670
Type:
Small organic molecule
Emp. Form.:
C98H163N19O22
Mol. Mass.:
1959.4569
SMILES:
CCCCCCCCCCCCCCCCCC(=O)NC[C@H]1CC[C@@H](CC1)C(=O)N[C@@H](CCC(=O)NCCCOCCOCCOCCCNC(=O)COCC(=O)N[C@@H](Cc1ccc(O)cc1)C(=O)NC(C)(Cc1ccccc1)C(=O)N[C@@H](CC(C)C)C(=O)NC(CCCC)C(=O)N[C@@H](CCCNC(N)=N)C(=O)N1CCC[C@H]1C(=O)N[C@@H](CCCNC(=N)NC)C(=O)N[C@@H](CC(N)=O)C(O)=O)C(O)=O
: