Target
Aurora kinase A
Ligand
BDBM50004205
Substrate
Meas. Tech.
ChEBML_1697673
IC50
30±n/a nM
Citation
 Hofmans, SDevisscher, LMartens, SVan Rompaey, DGoossens, KDivert, TNerinckx, WTakahashi, NDe Winter, HVan Der Veken, PGoossens, VVandenabeele, PAugustyns, K Tozasertib Analogues as Inhibitors of Necroptotic Cell Death. J Med Chem 61:1895-1920 (2018)  
Target
Name:
Aurora kinase A
Synonyms:
AIK ARK-1 AURA AURKA_HUMAN Aurora 2 Aurora kinase A (AURKA) Aurora kinase A (Aurora-2) Aurora/IPL1-related kinase 1 Breast tumor-amplified kinase IAK1 STK15 GN Serine/threonine kinase 15 Serine/threonine-protein kinase 6 Serine/threonine-protein kinase aurora-A aurora-2 | hARK1
Type:
Serine/threonine-protein kinase
Mol. Mass.:
45830.98
Organism:
Homo sapiens (Human)
Description:
O14965
Residue:
403
  
Inhibitor
Name:
BDBM50004205
Synonyms:
MK-045 TOZASERTIB VX-68 | VX-680
Type:
Small organic molecule
Emp. Form.:
C23H28N8OS
Mol. Mass.:
464.586
SMILES:
CN1CCN(CC1)c1cc(Nc2cc(C)[nH]n2)nc(Sc2ccc(NC(=O)C3CC3)cc2)n1
: