Target
Cysteine protease
Ligand
BDBM50263571
Substrate
Meas. Tech.
ChEBML_1698165
Ki
3.0±n/a nM
Citation
 Giroud, MDietzel, UAnselm, LBanner, DKuglstatter, ABenz, JBlanc, JBGaufreteau, DLiu, HLin, XStich, AKuhn, BSchuler, FKaiser, MBrun, RSchirmeister, TKisker, CDiederich, FHaap, W Repurposing a Library of Human Cathepsin L Ligands: Identification of Macrocyclic Lactams as Potent Rhodesain and Trypanosoma brucei Inhibitors. J Med Chem 61:3350-3369 (2018)  
Target
Name:
Cysteine protease
Synonyms:
Rhodesain
Type:
PROTEIN
Mol. Mass.:
48425.78
Organism:
Trypanosoma brucei rhodesiense
Description:
ChEMBL_619861
Residue:
450
  
Inhibitor
Name:
BDBM50263571
Synonyms:
CHEMBL4062591
Type:
Small organic molecule
Emp. Form.:
C29H24Cl2N4O4
Mol. Mass.:
563.431
SMILES:
Clc1ccc(cn1)-c1ccc2c(OC\C=C\COc3ccc(C[C@H](NC2=O)C(=O)NC2(CC2)C#N)cc3Cl)c1
: