Target
Muscarinic acetylcholine receptor M2
Ligand
BDBM50265979
Substrate
Meas. Tech.
ChEMBL_1700425 (CHEMBL4051407)
Kd
0.310000±n/a nM
Citation
 Pegoli, AShe, XWifling, DHübner, HBernhardt, GGmeiner, PKeller, M Radiolabeled Dibenzodiazepinone-Type Antagonists Give Evidence of Dualsteric Binding at the M J Med Chem 60:3314-3334 (2017)  
Target
Name:
Muscarinic acetylcholine receptor M2
Synonyms:
ACM2_HUMAN Cholinergic, muscarinic M2 Muscarinic acetylcholine receptor M2 and M5 | RecName: Full=Muscarinic acetylcholine receptor M2
Type:
GPCR
Mol. Mass.:
51730.61
Organism:
Homo sapiens (Human)
Description:
P08172
Residue:
466
  
Inhibitor
Name:
BDBM50265979
Synonyms:
CHEMBL4089543
Type:
Small organic molecule
Emp. Form.:
C84H95F12N15O17
Mol. Mass.:
1818.7405
SMILES:
OC(=O)C(F)(F)F.OC(=O)C(F)(F)F.OC(=O)C(F)(F)F.OC(=O)C(F)(F)F.[3H]CC([3H])C(=O)NCc1cc(cc(c1)C(=O)NCCNC(=O)CCc1cn(CCCCC2CCN(CC(=O)N3c4ccccc4NC(=O)c4ccccc34)CC2)cn1)C(=O)NCCNC(=O)CCc1cn(CCCCC2CCN(CC(=O)N3c4ccccc4NC(=O)c4ccccc34)CC2)cn1
: