Target
15-hydroxyprostaglandin dehydrogenase [NAD(+)]
Ligand
BDBM50266264
Substrate
Meas. Tech.
ChEMBL_1700506 (CHEMBL4051488)
IC50
2.6±n/a nM
Citation
 Antczak, MIZhang, YWang, CDoran, JNaidoo, JVoruganti, SWilliams, NSMarkowitz, SDReady, JM Inhibitors of 15-Prostaglandin Dehydrogenase To Potentiate Tissue Repair. J Med Chem 60:3979-4001 (2017)  
Target
Name:
15-hydroxyprostaglandin dehydrogenase [NAD(+)]
Synonyms:
15-PGDH HPGD PGDH_HUMAN SDR36C1
Type:
Enzyme
Mol. Mass.:
28974.46
Organism:
Homo sapiens (Human)
Description:
P15428
Residue:
266
  
Inhibitor
Name:
BDBM50266264
Synonyms:
CHEMBL4092188
Type:
Small organic molecule
Emp. Form.:
C19H18N4O2S2
Mol. Mass.:
398.502
SMILES:
CCCC[S+]([O-])c1sc2nc(nc(-c3ccccc3)c2c1N)-c1cocn1
: