Target
Adenosine receptor A2a
Ligand
BDBM50266652
Substrate
Meas. Tech.
ChEMBL_1701169 (CHEMBL4052151)
EC50
2.9±n/a nM
Citation
 Petrelli, RScortichini, MKachler, SBoccella, SCerchia, CTorquati, IDel Bello, FSalvemini, DNovellino, ELuongo, LMaione, SJacobson, KALavecchia, AKlotz, KNCappellacci, L Exploring the Role of N J Med Chem 60:4327-4341 (2017)  
Target
Name:
Adenosine receptor A2a
Synonyms:
A2A adenosine receptor (hA2A) ADENOSINE A2 ADORA2 Adenosine A2A receptor (A2AAR)
Type:
G Protein-Coupled Receptor (GPCR)
Mol. Mass.:
44716.46
Organism:
Homo sapiens (Human)
Description:
P29274
Residue:
412
  
Inhibitor
Name:
BDBM50266652
Synonyms:
CHEMBL4078479
Type:
Small organic molecule
Emp. Form.:
C19H20IN9O3
Mol. Mass.:
549.3251
SMILES:
CCn1nnc(n1)[C@H]1O[C@H]([C@H](O)[C@@H]1O)n1cnc2c(NCc3cccc(I)c3)ncnc12
: